Reaction Details
TargetDNA polymerase alpha catalytic subunit
LigandBDBM50013074
Substrate/Competitorn/a
Meas. Tech.ChEBML_50810
Ki 7500±n/a nM
Citation Wright, GEDudycz, LW Synthesis and characterization of N2-(p-n-butylphenyl)-2'-deoxyguanosine and its 5'-triphosphate and their inhibition of HeLa DNA polymerase alpha. J Med Chem27:175-81 (1984) DNA polymerase alpha catalytic subunit
Name:DNA polymerase alpha catalytic subunit
Type:PROTEIN
Mol. Mass.:165895.25
Organism:Homo sapiens (Human)
Description:ChEMBL_1365493
Residue:1462
BDBM50013074
NameBDBM50013074
Synonyms:2-(4-Butyl-phenylamino)-1,9-dihydro-purin-6-one CHEMBL16193
TypeSmall organic molecule
Emp. Form.C15H17N5O
Mol. Mass.283.3284
SMILESCCCCc1ccc(Nc2nc3nc[nH]c3c(=O)[nH]2)cc1