Reaction Details
TargetAngiotensin-converting enzyme
LigandBDBM50021151
Substrate/Competitorn/a
Meas. Tech.ChEBML_35992
IC50 4±n/a nM
Citation Stanton, JLWatthey, JWDesai, MNFinn, BMBabiarz, JETomaselli, HC Angiotensin converting enzyme inhibitors: structure-activity profile of 1-benzazepin-2-one derivatives. J Med Chem28:1603-6 (1985) Angiotensin-converting enzyme
Name:Angiotensin-converting enzyme
Type:Enzyme
Mol. Mass.:149709.01
Organism:Homo sapiens (Human)
Description:n/a
Residue:1306
BDBM50021151
NameBDBM50021151
Synonyms:6-tert-Butoxycarbonylamino-2-(1-carboxymethyl-2-oxo-2,3,4,5-tetrahydro-1H-benzo[b]azepin-3-ylamino)-hexanoic acid | CHEMBL40420
TypeSmall organic molecule
Emp. Form.C23H33N3O7
Mol. Mass.463.524
SMILESCC(C)(C)OC(=O)NCCCC[C@H](N[C@H]1CCc2ccccc2N(CC(O)=O)C1=O)C(O)=O