Reaction Details
TargetRenin
LigandBDBM50025937
Substrate/Competitorn/a
Meas. Tech.ChEMBL_196268 (CHEMBL883369)
Ki 0.520000±n/a nM
Citation Boger, JPayne, LSPerlow, DSLohr, NSPoe, MBlaine, EHUlm, EHSchorn, TWLaMont, BILin, TY Renin inhibitors. Syntheses of subnanomolar, competitive, transition-state analogue inhibitors containing a novel analogue of statine. J Med Chem28:1779-90 (1986) Renin
Name:Renin
Type:Enzyme
Mol. Mass.:45058.99
Organism:Homo sapiens (Human)
Description:n/a
Residue:406
BDBM50025937
NameBDBM50025937
Synonyms:CHEMBL3144417 | {1-[1-{3-[1-(1-Carbamoyl-2-phenyl-ethylcarbamoyl)-3-methyl-butylcarbamoyl]-1-cyclohexylmethyl-2-hydroxy-propylcarbamoyl}-2-(1H-imidazol-4-yl)-ethylcarbamoyl]-2-phenyl-ethyl}-carbamic acid ethyl ester
TypeSmall organic molecule
Emp. Form.C44H62N8O8
Mol. Mass.831.0119
SMILESCCOC(=O)N[C@@H](Cc1ccccc1)C(=O)N[C@@H](Cc1c[nH]cn1)C(=O)N[C@@H](CC1CCCCC1)[C@@H](O)CC(=O)N[C@@H](CC(C)C)C(=O)N[C@@H](Cc1ccccc1)C(N)=O