Reaction Details
TargetRenin
LigandBDBM50025939
Substrate/Competitorn/a
Meas. Tech.ChEMBL_196268 (CHEMBL883369)
Ki 49±n/a nM
Citation Boger, JPayne, LSPerlow, DSLohr, NSPoe, MBlaine, EHUlm, EHSchorn, TWLaMont, BILin, TY Renin inhibitors. Syntheses of subnanomolar, competitive, transition-state analogue inhibitors containing a novel analogue of statine. J Med Chem28:1779-90 (1986) Renin
Name:Renin
Type:Enzyme
Mol. Mass.:45058.99
Organism:Homo sapiens (Human)
Description:n/a
Residue:406
BDBM50025939
NameBDBM50025939
Synonyms:CHEMBL3144412 | {1-[1-{1-Benzyl-3-[1-(1-carbamoyl-2-phenyl-ethylcarbamoyl)-3-methyl-butylcarbamoyl]-2-hydroxy-propylcarbamoyl}-2-(1H-imidazol-4-yl)-ethylcarbamoyl]-2-phenyl-ethyl}-carbamic acid tert-butyl ester
TypeSmall organic molecule
Emp. Form.C46H60N8O8
Mol. Mass.853.0174
SMILESCC(C)C[C@H](NC(=O)C[C@H](O)[C@H](Cc1ccccc1)NC(=O)[C@H](Cc1c[nH]cn1)NC(=O)[C@H](Cc1ccccc1)NC(=O)OC(C)(C)C)C(=O)N[C@@H](Cc1ccccc1)C(N)=O