Reaction Details
TargetRenin
LigandBDBM50405191
Substrate/Competitorn/a
Meas. Tech.ChEMBL_196268 (CHEMBL883369)
Ki 8.8±n/a nM
Citation Boger, JPayne, LSPerlow, DSLohr, NSPoe, MBlaine, EHUlm, EHSchorn, TWLaMont, BILin, TY Renin inhibitors. Syntheses of subnanomolar, competitive, transition-state analogue inhibitors containing a novel analogue of statine. J Med Chem28:1779-90 (1986) Renin
Name:Renin
Type:Enzyme
Mol. Mass.:45058.99
Organism:Homo sapiens (Human)
Description:n/a
Residue:406
BDBM50405191
NameBDBM50405191
Synonyms:CHEMBL269752
TypeSmall organic molecule
Emp. Form.C54H77N13O9
Mol. Mass.1052.2709
SMILESCC[C@](C)(N)C(=O)N[C@@H](Cc1c[nH]cn1)C(=O)N1CCC[C@H]1C(=O)N[C@@H](Cc1ccccc1)C(=O)N[C@@H](Cc1c[nH]cn1)C(=O)NC(CC(C)C)C(O)CC(=O)N[C@@H](CC(C)C)C(=O)N[C@@H](Cc1ccccc1)C(N)=O