Reaction Details
TargetRenin
LigandBDBM50405190
Substrate/Competitorn/a
Meas. Tech.ChEMBL_162738 (CHEMBL765217)
Ki 0.540000±n/a nM
Citation Boger, JPayne, LSPerlow, DSLohr, NSPoe, MBlaine, EHUlm, EHSchorn, TWLaMont, BILin, TY Renin inhibitors. Syntheses of subnanomolar, competitive, transition-state analogue inhibitors containing a novel analogue of statine. J Med Chem28:1779-90 (1986) Renin
Name:Renin
Type:Enzyme
Mol. Mass.:45058.99
Organism:Homo sapiens (Human)
Description:n/a
Residue:406
BDBM50405190
NameBDBM50405190
Synonyms:CHEMBL2028991
TypeSmall organic molecule
Emp. Form.C57H80N12O9
Mol. Mass.1077.3201
SMILESCC(C)C[C@H](NC(=O)CC(O)[C@H](CC1CCCCC1)NC(=O)[C@H](Cc1cnc[nH]1)NC(=O)[C@H](Cc1ccccc1)NC(=O)[C@@H]1CCCN1C(=O)[C@H](Cc1cnc[nH]1)NC(=O)CC(C)C)C(=O)N[C@@H](Cc1ccccc1)C(N)=O