Reaction Details
TargetMu-type opioid receptor
LigandBDBM50021258
Substrate/Competitorn/a
Meas. Tech.ChEBML_148683
IC50 10±n/a nM
Citation Archer, SMichael, JOsei-Gyimah, PSeyed-Mozaffari, AZukin, RSManeckjee, RSimon, EJGioannini, TL Hybromet: a ligand for purifying opioid receptors. J Med Chem28:1950-3 (1986) Mu-type opioid receptor
Name:Mu-type opioid receptor
Type:G Protein-Coupled Receptor (GPCR)
Mol. Mass.:44503.11
Organism:Rattus norvegicus (rat)
Description:Competition binding assays were carried out using membrane preparations from transfected HN9.10 cells that constitutively expressed the mu opioid receptor.
Residue:398
BDBM50021258
NameBDBM50021258
Synonyms:4-(4-allyloxyphenyl)-2-(11,15-dimethoxy-3-methyl-13-oxa-3-azahexacyclo[13.2.2.12,8.01,6.06,14.07,12]icosa-7,9,11,18-tetraen-16-yl)-2-butanol | CHEMBL59280
TypeSmall organic molecule
Emp. Form.C34H41NO5
Mol. Mass.543.693
SMILESCOc1ccc2CC3N(C)CCC45[C@@H](Oc1c24)[C@@]1(OC)C=C[C@@]35C[C@@H]1[C@@](C)(O)CCc1ccc(OCC=C)cc1