Reaction Details
TargetDihydrofolate reductase
LigandBDBM50026308
Substrate/Competitorn/a
Meas. Tech.ChEMBL_54542 (CHEMBL664859)
Ki 0.035000±n/a nM
Citation Kuyper, LFRoth, BBaccanari, DPFerone, RBeddell, CRChampness, JNStammers, DKDann, JGNorrington, FEBaker, DJ Receptor-based design of dihydrofolate reductase inhibitors: comparison of crystallographically determined enzyme binding with enzyme affinity in a series of carboxy-substituted trimethoprim analogues. J Med Chem28:303-11 (1985) Dihydrofolate reductase
Name:Dihydrofolate reductase
Type:n/a
Mol. Mass.:17532.46
Organism:Escherichia coli
Description:n/a
Residue:157
BDBM50026308
NameBDBM50026308
Synonyms:4-[5-(2,4-Diamino-pyrimidin-5-ylmethyl)-2,3-dimethoxy-phenoxy]-butyric acid TCMDC-137359
TypeSmall organic molecule
Emp. Form.C17H22N4O5
Mol. Mass.362.3804
SMILESCOc1cc(Cc2cnc(N)nc2N)cc(OCCCC(O)=O)c1OC