Reaction Details
TargetAngiotensin-converting enzyme
LigandBDBM50020831
Substrate/Competitorn/a
Meas. Tech.ChEBML_34797
IC50 0.002±n/a nM
Citation Menard, PRSuh, JTJones, HLoev, BNeiss, ESWilde, JSchwab, AMann, WS Angiotensin converting enzyme inhibitors. (Mercaptoaroyl)amino acids. J Med Chem28:328-32 (1985) Angiotensin-converting enzyme
Name:Angiotensin-converting enzyme
Type:n/a
Mol. Mass.:150405.15
Organism:Oryctolagus cuniculus
Description:n/a
Residue:1310
BDBM50020831
NameBDBM50020831
Synonyms:CHEMBL113315 | [(2-Acetylsulfanyl-3-methyl-benzoyl)-cyclopentyl-amino]-acetic acid
TypeSmall organic molecule
Emp. Form.C17H21NO4S
Mol. Mass.335.418
SMILESCC(=O)Sc1c(C)cccc1C(=O)N(CC(O)=O)C1CCCC1