Reaction Details
TargetAngiotensin-converting enzyme
LigandBDBM50020841
Substrate/Competitorn/a
Meas. Tech.ChEBML_34797
IC50 0.005±n/a nM
Citation Menard, PRSuh, JTJones, HLoev, BNeiss, ESWilde, JSchwab, AMann, WS Angiotensin converting enzyme inhibitors. (Mercaptoaroyl)amino acids. J Med Chem28:328-32 (1985) Angiotensin-converting enzyme
Name:Angiotensin-converting enzyme
Type:n/a
Mol. Mass.:150405.15
Organism:Oryctolagus cuniculus
Description:n/a
Residue:1310
BDBM50020841
NameBDBM50020841
Synonyms:CHEMBL324242 | [Cyclopentyl-(2-mercapto-3-methyl-benzoyl)-amino]-acetic acid
TypeSmall organic molecule
Emp. Form.C15H19NO3S
Mol. Mass.293.381
SMILESCc1cccc(C(=O)N(CC(O)=O)C2CCCC2)c1S