Reaction Details
TargetNeprilysin
LigandBDBM21641
Substrate/Competitorn/a
Meas. Tech.ChEBML_64519
Ki 40±n/a nM
Citation Elliott, RLMarks, NBerg, MJPortoghese, PS Synthesis and biological evaluation of phosphonamidate peptide inhibitors of enkephalinase and angiotensin-converting enzyme. J Med Chem28:1208-16 (1985) Neprilysin
Name:Neprilysin
Type:Protein
Mol. Mass.:85789.59
Organism:Rattus norvegicus (Rat)
Description:P07861
Residue:750
BDBM21641
NameBDBM21641
Synonyms:2-(2-benzyl-3-sulfanylpropanamido)acetic acid Thiorphan
TypeSmall organic molecule
Emp. Form.C12H15NO3S
Mol. Mass.253.317
SMILESOC(=O)CNC(=O)C(CS)Cc1ccccc1