Reaction Details
TargetAngiotensin-converting enzyme
LigandBDBM50021039
Substrate/Competitorn/a
Meas. Tech.ChEBML_36882
IC50 86±n/a nM
Citation Roark, WHTinney, FJCohen, DEssenburg, ADKaplan, HR Synthesis and biological activity of modified peptide inhibitors of angiotensin-converting enzyme. J Med Chem28:1291-5 (1985) Angiotensin-converting enzyme
Name:Angiotensin-converting enzyme
Type:Enzyme
Mol. Mass.:149709.01
Organism:Homo sapiens (Human)
Description:n/a
Residue:1306
BDBM50021039
NameBDBM50021039
Synonyms:(S,S)-2-[2-(1-Carboxy-3-phenyl-propoxy)-propionyl]-1,2,3,4-tetrahydro-isoquinoline-3-carboxylic acid | CHEMBL26226
TypeSmall organic molecule
Emp. Form.C23H25NO6
Mol. Mass.411.4477
SMILESCC(OC(CCc1ccccc1)C(O)=O)C(=O)N1Cc2ccccc2CC1C(O)=O