Reaction Details
Target2-5A-dependent ribonuclease
LigandBDBM50021104
Substrate/Competitorn/a
Meas. Tech.ChEBML_164144
IC50 320±n/a nM
Citation Sawai, HLesiak, KImai, JTorrence, PF Replacement of the ribofuranose oxygen of 2-5A derivatives by methylene: synthesis of an aristeromycin analogue of 2-5A core 5'-monophosphate (5'-O-phosphoryladenylyl)(2'----5')adenyl(2'----5')adenosine. J Med Chem28:1376-80 (1985) 2-5A-dependent ribonuclease
Name:2-5A-dependent ribonuclease
Type:PROTEIN
Mol. Mass.:83274.00
Organism:Mus musculus
Description:ChEMBL_195099
Residue:735
BDBM50021104
NameBDBM50021104
Synonyms:(2'-5'(pAris)3
TypeSmall organic molecule
Emp. Form.C33H40N15O16P3
Mol. Mass.995.6851
SMILESNc1ncnc2n(cnc12)C1CC(COP([O-])(=O)OC2C(O)C(COP([O-])(=O)OC3C(O)C(COP([O-])([O-])=O)CC3n3cnc4c(N)ncnc34)CC2n2cnc3c(N)ncnc23)C(O)C1O