Reaction Details
TargetAngiotensin-converting enzyme
LigandBDBM50452254
Substrate/Competitorn/a
Meas. Tech.ChEBML_36890
IC50 6100±n/a nM
Citation Klutchko, SBlankley, CJFleming, RWHinkley, JMWerner, AENordin, IHolmes, AHoefle, MLCohen, DMEssenburg, AD Synthesis of novel angiotensin converting enzyme inhibitor quinapril and related compounds. A divergence of structure-activity relationships for non-sulfhydryl and sulfhydryl types. J Med Chem29:1953-61 (1986) Angiotensin-converting enzyme
Name:Angiotensin-converting enzyme
Type:Enzyme
Mol. Mass.:149709.01
Organism:Homo sapiens (Human)
Description:n/a
Residue:1306
BDBM50452254
NameBDBM50452254
Synonyms:CHEMBL2115288
TypeSmall organic molecule
Emp. Form.C25H30N2O5
Mol. Mass.438.5161
SMILESCCOC(=O)[C@H](CCc1ccccc1)N[C@@H](C)C(=O)N1Cc2ccccc2C[C@@H]1C(O)=O