Reaction Details
TargetDelta-type opioid receptor
LigandBDBM50252861
Substrate/Competitorn/a
Meas. Tech.ChEBML_146760
IC50 13500±n/a nM
Citation Pelton, JTKazmierski, WGulya, KYamamura, HIHruby, VJ Design and synthesis of conformationally constrained somatostatin analogues with high potency and specificity for mu opioid receptors. J Med Chem29:2370-5 (1986) Delta-type opioid receptor
Name:Delta-type opioid receptor
Type:G Protein-Coupled Receptor (GPCR)
Mol. Mass.:40465.04
Organism:Rattus norvegicus (rat)
Description:Competition binding assays were using CHO-K1 cell membranes expressing the opioid receptor.
Residue:372
BDBM50252861
NameBDBM50252861
Synonyms:CHEMBL507214 | H-D-Phe-c[Cys-Tyr-DTrp-Orn-Thr-Pen]-Thr-NH2
TypeSmall organic molecule
Emp. Form.C50H67N11O11S2
Mol. Mass.1062.264
SMILESC[C@@H](O)[C@H](NC(=O)[C@H]1NC(=O)[C@@H](NC(=O)[C@H](CCCN)NC(=O)[C@@H](Cc2c[nH]c3ccccc23)NC(=O)[C@H](Cc2ccc(O)cc2)NC(=O)[C@H](CSSC1(C)C)NC(=O)[C@H](N)Cc1ccccc1)[C@@H](C)O)C(N)=O