Reaction Details
TargetDihydrofolate reductase
LigandBDBM50226277
Substrate/Competitorn/a
Meas. Tech.ChEMBL_54888 (CHEMBL666942)
IC50 5.98±n/a nM
Citation Piper, JRMcCaleb, GSMontgomery, JAKisliuk, RLGaumont, YSirotnak, FM Syntheses and antifolate activity of 5-methyl-5-deaza analogues of aminopterin, methotrexate, folic acid, and N10-methylfolic acid. J Med Chem29:1080-7 (1986) Dihydrofolate reductase
Name:Dihydrofolate reductase
Type:PROTEIN
Mol. Mass.:18437.08
Organism:Lactobacillus casei
Description:ChEMBL_1357878
Residue:163
BDBM50226277
NameBDBM50226277
Synonyms:CHEMBL273509
TypeSmall organic molecule
Emp. Form.C22H24N6O6
Mol. Mass.468.4626
SMILESCN(Cc1cnc2nc(N)nc(O)c2c1C)c1ccc(cc1)C(=O)NC(CCC(O)=O)C(O)=O