Reaction Details
TargetThymidylate synthase
LigandBDBM50226275
Substrate/Competitorn/a
Meas. Tech.ChEMBL_209101 (CHEMBL811703)
IC50 0.000±n/a nM
Citation Piper, JRMcCaleb, GSMontgomery, JAKisliuk, RLGaumont, YSirotnak, FM Syntheses and antifolate activity of 5-methyl-5-deaza analogues of aminopterin, methotrexate, folic acid, and N10-methylfolic acid. J Med Chem29:1080-7 (1986) Thymidylate synthase
Name:Thymidylate synthase
Type:Enzyme
Mol. Mass.:36576.54
Organism:Lactobacillus casei
Description:n/a
Residue:316
BDBM50226275
NameBDBM50226275
Synonyms:CHEMBL267104
TypeSmall organic molecule
Emp. Form.C21H22N6O6
Mol. Mass.454.436
SMILESCc1c(CNc2ccc(cc2)C(=O)NC(CCC(O)=O)C(O)=O)cnc2nc(N)nc(O)c12