Reaction Details
TargetDihydrofolate reductase
LigandBDBM50016326
Substrate/Competitorn/a
Meas. Tech.ChEBML_54595
Ki 0.00293±0.0001 nM
Citation Piper, JRMcCaleb, GSMontgomery, JAKisliuk, RLGaumont, YSirotnak, FM Syntheses and antifolate activity of 5-methyl-5-deaza analogues of aminopterin, methotrexate, folic acid, and N10-methylfolic acid. J Med Chem29:1080-7 (1986) Dihydrofolate reductase
Name:Dihydrofolate reductase
Type:Enzyme
Mol. Mass.:21608.82
Organism:Mus musculus (Mouse)
Description:n/a
Residue:187
BDBM50016326
NameBDBM50016326
Synonyms:2-{4-[(2,4-Diamino-5-methyl-pyrido[2,3-d]pyrimidin-6-ylmethyl)-amino]-benzoylamino}-pentanedioic acid | CHEMBL428862
TypeSmall organic molecule
Emp. Form.C21H23N7O5
Mol. Mass.453.4512
SMILESCc1c(CNc2ccc(cc2)C(=O)NC(CCC(O)=O)C(O)=O)cnc2nc(N)nc(N)c12