Reaction Details
TargetDihydrofolate reductase
LigandBDBM50016325
Substrate/Competitorn/a
Meas. Tech.ChEBML_54595
Ki 0.00365±0.0007 nM
Citation Piper, JRMcCaleb, GSMontgomery, JAKisliuk, RLGaumont, YSirotnak, FM Syntheses and antifolate activity of 5-methyl-5-deaza analogues of aminopterin, methotrexate, folic acid, and N10-methylfolic acid. J Med Chem29:1080-7 (1986) Dihydrofolate reductase
Name:Dihydrofolate reductase
Type:Enzyme
Mol. Mass.:21608.82
Organism:Mus musculus (Mouse)
Description:n/a
Residue:187
BDBM50016325
NameBDBM50016325
Synonyms:2-{4-[(2,4-Diamino-pyrido[2,3-d]pyrimidin-6-ylmethyl)-amino]-benzoylamino}-pentanedioic acid | CHEMBL275309
TypeSmall organic molecule
Emp. Form.C20H21N7O5
Mol. Mass.439.4246
SMILESNc1nc(N)c2cc(CNc3ccc(cc3)C(=O)NC(CCC(O)=O)C(O)=O)cnc2n1