Reaction Details
TargetRenin
LigandBDBM50024174
Substrate/Competitorn/a
Meas. Tech.ChEMBL_154904 (CHEMBL878421)
IC50 190±n/a nM
Citation Guégan, RDiaz, JCazaubon, CBeaumont, MCarlet, CClément, JDemarne, HMellet, MRichaud, JPSegondy, D Pepstatin analogues as novel renin inhibitors. J Med Chem29:1152-9 (1987) Renin
Name:Renin
Type:PROTEIN
Mol. Mass.:44272.67
Organism:Rattus norvegicus
Description:ChEMBL_222765
Residue:402
BDBM50024174
NameBDBM50024174
Synonyms:4-(2-{4-[2-(2-tert-Butoxycarbonylamino-3-phenyl-propionylamino)-3-phenyl-propionylamino]-3-hydroxy-6-methyl-heptanoylamino}-propionylamino)-3-hydroxy-6-methyl-heptanoic acid methyl ester | CHEMBL3142787
TypeSmall organic molecule
Emp. Form.C43H65N5O10
Mol. Mass.812.0037
SMILESCOC(=O)C[C@H](O)[C@H](CC(C)C)NC(=O)[C@H](C)NC(=O)C[C@H](O)[C@H](CC(C)C)NC(=O)[C@H](Cc1ccccc1)NC(=O)[C@H](Cc1ccccc1)NC(=O)OC(C)(C)C