Reaction Details
TargetRenin
LigandBDBM50024167
Substrate/Competitorn/a
Meas. Tech.ChEMBL_154904 (CHEMBL878421)
IC50 600±n/a nM
Citation Guégan, RDiaz, JCazaubon, CBeaumont, MCarlet, CClément, JDemarne, HMellet, MRichaud, JPSegondy, D Pepstatin analogues as novel renin inhibitors. J Med Chem29:1152-9 (1987) Renin
Name:Renin
Type:PROTEIN
Mol. Mass.:44272.67
Organism:Rattus norvegicus
Description:ChEMBL_222765
Residue:402
BDBM50024167
NameBDBM50024167
Synonyms:3-Hydroxy-4-[2-(3-hydroxy-6-methyl-4-{2-[2-(3-methyl-butyrylamino)-3-phenyl-propionylamino]-hexanoylamino}-heptanoylamino)-propionylamino]-6-methyl-heptanoic acid | CHEMBL3142792
TypeSmall organic molecule
Emp. Form.C39H65N5O9
Mol. Mass.747.9615
SMILESCCCC[C@H](NC(=O)[C@H](Cc1ccccc1)NC(=O)CC(C)C)C(=O)N[C@@H](CC(C)C)[C@@H](O)CC(=O)N[C@@H](C)C(=O)N[C@@H](CC(C)C)[C@@H](O)CC(O)=O