Reaction Details
TargetRenin
LigandBDBM50024165
Substrate/Competitorn/a
Meas. Tech.ChEMBL_154892 (CHEMBL763034)
IC50 47±n/a nM
Citation Guégan, RDiaz, JCazaubon, CBeaumont, MCarlet, CClément, JDemarne, HMellet, MRichaud, JPSegondy, D Pepstatin analogues as novel renin inhibitors. J Med Chem29:1152-9 (1987) Renin
Name:Renin
Type:PROTEIN
Mol. Mass.:44272.67
Organism:Rattus norvegicus
Description:ChEMBL_222765
Residue:402
BDBM50024165
NameBDBM50024165
Synonyms:4-[2-(4-{1-[1-Benzyl-2-(3-methyl-butyrylamino)-2-oxo-ethylcarbamoyl]-butylamino}-3-hydroxy-6-methyl-heptanoylamino)-propionylamino]-3-hydroxy-6-methyl-heptanoic acid methyl ester | CHEMBL3142810
TypeSmall organic molecule
Emp. Form.C39H65N5O9
Mol. Mass.747.9615
SMILESCCC[C@H](N[C@@H](CC(C)C)[C@@H](O)CC(=O)N[C@@H](C)C(=O)N[C@@H](CC(C)C)[C@@H](O)CC(=O)OC)C(=O)N[C@@H](Cc1ccccc1)C(=O)NC(=O)CC(C)C