Reaction Details
TargetPurine nucleoside phosphorylase
LigandBDBM50022243
Substrate/Competitorn/a
Meas. Tech.ChEBML_162174
IC50 1550±n/a nM
Citation Sircar, JCSuto, MJScott, MEDong, MKGilbertsen, RB Inhibitors of human purine nucleoside phosphorylase. Synthesis, purine nucleoside phosphorylase inhibition, and T-cell cytotoxicity of 2,5-diaminothiazolo[5,4-d]pyrimidin-7(6H)-one and 2,5-diaminothiazolo[4,5-d]pyrimidin-7(6H)-one. Two thio isosteres of 8-aminoguanine. J Med Chem29:1804-6 (1986) Purine nucleoside phosphorylase
Name:Purine nucleoside phosphorylase
Type:Enzyme
Mol. Mass.:32119.53
Organism:Homo sapiens (Human)
Description:n/a
Residue:289
BDBM50022243
NameBDBM50022243
Synonyms:2,8-Diamino-1,9-dihydro-purin-6-one CHEMBL8040
TypeSmall organic molecule
Emp. Form.C5H6N6O
Mol. Mass.166.1407
SMILESNc1nc2nc(N)[nH]c(=O)c2[nH]1