Reaction Details
TargetAdenosine receptor A1/A2a/A2b/A3
LigandBDBM50016451
Substrate/Competitorn/a
Meas. Tech.ChEMBL_31138 (CHEMBL644805)
Ki 2.1±n/a nM
Citation Jacobson, KALipkowski, AWMoody, TWPadgett, WPijl, EKirk, KLDaly, JW Binary drugs: conjugates of purines and a peptide that bind to both adenosine and substance P receptors. J Med Chem30:1529-32 (1987) Adenosine receptor A1/A2a/A2b/A3
Name:Adenosine receptor A1/A2a/A2b/A3
Synonyms:Adenosine receptor
Type:n/a
Mol. Mass.:n/a
Description:ASSAY_ID of ChEMBL is 194205
Components:This complex has 4 components.
Component 1
Name:Adenosine receptor A2a
Type:G Protein-Coupled Receptor (GPCR)
Mol. Mass.:45015.65
Organism:Rattus norvegicus (rat)
Description:Rat A2A receptors expressed in CHO cells.
Residue:410
Component 2
Name:Adenosine receptor A3
Synonyms:AA3R_RAT Adenosine receptor A2a and A3 | Adora3
Type:PROTEIN
Mol. Mass.:36643.73
Organism:Rattus norvegicus
Description:ChEMBL_479910
Residue:320
Component 3
Name:Adenosine receptor A1
Synonyms:AA1R_RAT ADENOSINE A1 high Adenosine A1 receptor (A1) Adenosine receptors A1 | Adora1
Type:Protein
Mol. Mass.:36704.13
Organism:Rattus norvegicus (rat)
Description:n/a
Residue:326
Component 4
Name:Adenosine receptor A2b
Synonyms:AA2BR_RAT Adora2b
Type:PROTEIN
Mol. Mass.:36378.84
Organism:Rattus norvegicus
Description:ChEMBL_32934
Residue:332
BDBM50016451
NameBDBM50016451
Synonyms:CHEMBL37306 | N-[2-(2-Amino-acetylamino)-ethyl]-2-[4-(2,6-dioxo-1,3-dipropyl-2,3,4,5,6,7-hexahydro-1H-purin-8-yl)-phenoxy]-acetamide
TypeSmall organic molecule
Emp. Form.C23H33N7O5
Mol. Mass.487.552
SMILESCCCn1c2NC(Nc2c(=O)n(CCC)c1=O)c1ccc(OCC(=O)NCCNC(=O)CN)cc1