Reaction Details
TargetAlpha-1A adrenergic receptor
LigandBDBM50019061
Substrate/Competitorn/a
Meas. Tech.ChEMBL_33232 (CHEMBL873047)
Ki 1500±n/a nM
Citation Adejare, AGusovsky, FPadgett, WCreveling, CRDaly, JWKirk, KL Syntheses and adrenergic activities of ring-fluorinated epinephrines. J Med Chem31:1972-7 (1988) Alpha-1A adrenergic receptor
Name:Alpha-1A adrenergic receptor
Type:Cell-surface receptors
Mol. Mass.:51511.67
Organism:Homo sapiens (Human)
Description:P35348
Residue:466
BDBM50019061
NameBDBM50019061
Synonyms:(+/-)4-(2-Amino-1-hydroxy-ethyl)-5-fluoro-benzene-1,2-diol 4-(2-Amino-1-hydroxy-ethyl)-5-fluoro-benzene-1,2-diol(6-FNE) | CHEMBL281232
TypeSmall organic molecule
Emp. Form.C8H10FNO3
Mol. Mass.187.1683
SMILESNCC(O)c1cc(O)c(O)cc1F