Reaction Details
TargetMu-type opioid receptor
LigandBDBM50001683
Substrate/Competitorn/a
Meas. Tech.ChEBML_148839
Ki 873±n/a nM
Citation Gacel, GZajac, JMDelay-Goyet, PDaugé, VRoques, BP Investigation of the structural parameters involved in the mu and delta opioid receptor discrimination of linear enkephalin-related peptides. J Med Chem31:374-83 (1988) Mu-type opioid receptor
Name:Mu-type opioid receptor
Type:G Protein-Coupled Receptor (GPCR)
Mol. Mass.:44503.11
Organism:Rattus norvegicus (rat)
Description:Competition binding assays were carried out using membrane preparations from transfected HN9.10 cells that constitutively expressed the mu opioid receptor.
Residue:398
BDBM50001683
NameBDBM50001683
Synonyms:13-[2-Amino-3-(4-hydroxy-phenyl)-propionylamino]-7-benzyl-3,3,14,14-tetramethyl-6,9,12-trioxo-1,2-dithia-5,8,11-triaza-cyclotetradecane-4-carboxylic acid CHEMBL294616 | DPDPE
TypeSmall organic molecule
Emp. Form.C30H39N5O7S2
Mol. Mass.645.79
SMILESCC1(C)SSC(C)(C)[C@@H](NC(=O)[C@@H](N)Cc2ccc(O)cc2)C(=O)NCC(=O)N[C@H](Cc2ccccc2)C(=O)N[C@H]1C(O)=O