Reaction Details
TargetDelta-type opioid receptor
LigandBDBM50018713
Substrate/Competitorn/a
Meas. Tech.ChEBML_146893
Ki 2.7±n/a nM
Citation Gacel, GZajac, JMDelay-Goyet, PDaugé, VRoques, BP Investigation of the structural parameters involved in the mu and delta opioid receptor discrimination of linear enkephalin-related peptides. J Med Chem31:374-83 (1988) Delta-type opioid receptor
Name:Delta-type opioid receptor
Type:G Protein-Coupled Receptor (GPCR)
Mol. Mass.:40465.04
Organism:Rattus norvegicus (rat)
Description:Competition binding assays were using CHO-K1 cell membranes expressing the opioid receptor.
Residue:372
BDBM50018713
NameBDBM50018713
Synonyms:2-{2-[2-(2-{2-[2-Amino-3-(4-hydroxy-phenyl)-propionylamino]-3-hydroxy-butyrylamino}-acetylamino)-3-phenyl-propionylamino]-4-methyl-pentanoylamino}-4-methyl-pentanoic acid | CHEMBL127711
TypeSmall organic molecule
Emp. Form.C36H52N6O9
Mol. Mass.712.8329
SMILESCC(C)C[C@H](NC(=O)[C@H](CC(C)C)NC(=O)[C@H](Cc1ccccc1)NC(=O)CNC(=O)[C@H](NC(=O)[C@@H](N)Cc1ccc(O)cc1)[C@@H](C)O)C(O)=O