Reaction Details
TargetThymidylate synthase
LigandBDBM50023636
Substrate/Competitorn/a
Meas. Tech.ChEBML_209138
Ki 310±n/a nM
Citation Chang, GSchwepler, DDecedue, CJBalzarini, JDe Clercq, EMertes, MP Linear free energy relationship studies of enzyme active site binding: thymidylate synthase. J Med Chem31:1141-7 (1988) Thymidylate synthase
Name:Thymidylate synthase
Type:Enzyme
Mol. Mass.:36576.54
Organism:Lactobacillus casei
Description:n/a
Residue:316
BDBM50023636
NameBDBM50023636
Synonyms:CHEMBL3144190 | Phosphoric acid mono-{5-[5-(4-benzyloxy-phenyl)-2,4-dioxo-3,4-dihydro-2H-pyrimidin-1-yl]-3-hydroxy-tetrahydro-furan-2-ylmethyl} ester
TypeSmall organic molecule
Emp. Form.C22H23N2O9P
Mol. Mass.490.3998
SMILESO[C@H]1C[C@@H](O[C@@H]1COP(O)(O)=O)n1cc(-c2ccc(OCc3ccccc3)cc2)c(=O)[nH]c1=O