Reaction Details
TargetThymidylate synthase
LigandBDBM50023637
Substrate/Competitorn/a
Meas. Tech.ChEBML_209138
Ki 1130±n/a nM
Citation Chang, GSchwepler, DDecedue, CJBalzarini, JDe Clercq, EMertes, MP Linear free energy relationship studies of enzyme active site binding: thymidylate synthase. J Med Chem31:1141-7 (1988) Thymidylate synthase
Name:Thymidylate synthase
Type:Enzyme
Mol. Mass.:36576.54
Organism:Lactobacillus casei
Description:n/a
Residue:316
BDBM50023637
NameBDBM50023637
Synonyms:CHEMBL3144189 | Phosphoric acid mono-{5-[5-(4-amino-phenyl)-2,4-dioxo-3,4-dihydro-2H-pyrimidin-1-yl]-3-hydroxy-tetrahydro-furan-2-ylmethyl} ester
TypeSmall organic molecule
Emp. Form.C15H18N3O8P
Mol. Mass.399.2925
SMILESNc1ccc(cc1)-c1cn([C@H]2C[C@H](O)[C@@H](COP(O)(O)=O)O2)c(=O)[nH]c1=O