Reaction Details
TargetThymidylate synthase
LigandBDBM50023645
Substrate/Competitorn/a
Meas. Tech.ChEBML_209138
Ki 610±n/a nM
Citation Chang, GSchwepler, DDecedue, CJBalzarini, JDe Clercq, EMertes, MP Linear free energy relationship studies of enzyme active site binding: thymidylate synthase. J Med Chem31:1141-7 (1988) Thymidylate synthase
Name:Thymidylate synthase
Type:Enzyme
Mol. Mass.:36576.54
Organism:Lactobacillus casei
Description:n/a
Residue:316
BDBM50023645
NameBDBM50023645
Synonyms:CHEMBL3144187 | Phosphoric acid mono-[5-(2,4-dioxo-5-p-tolyl-3,4-dihydro-2H-pyrimidin-1-yl)-3-hydroxy-tetrahydro-furan-2-ylmethyl] ester
TypeSmall organic molecule
Emp. Form.C16H19N2O8P
Mol. Mass.398.3044
SMILESCc1ccc(cc1)-c1cn([C@H]2C[C@H](O)[C@@H](COP(O)(O)=O)O2)c(=O)[nH]c1=O