Reaction Details
TargetThymidylate synthase
LigandBDBM50023640
Substrate/Competitorn/a
Meas. Tech.ChEBML_209138
Ki 1210±n/a nM
Citation Chang, GSchwepler, DDecedue, CJBalzarini, JDe Clercq, EMertes, MP Linear free energy relationship studies of enzyme active site binding: thymidylate synthase. J Med Chem31:1141-7 (1988) Thymidylate synthase
Name:Thymidylate synthase
Type:Enzyme
Mol. Mass.:36576.54
Organism:Lactobacillus casei
Description:n/a
Residue:316
BDBM50023640
NameBDBM50023640
Synonyms:CHEMBL3144188 | Phosphoric acid mono-{3-hydroxy-5-[5-(4-methoxy-phenyl)-2,4-dioxo-3,4-dihydro-2H-pyrimidin-1-yl]-tetrahydro-furan-2-ylmethyl} ester
TypeSmall organic molecule
Emp. Form.C16H19N2O9P
Mol. Mass.414.3038
SMILESCOc1ccc(cc1)-c1cn([C@H]2C[C@H](O)[C@@H](COP(O)(O)=O)O2)c(=O)[nH]c1=O