Reaction Details
TargetFolylpolyglutamate synthase, mitochondrial
LigandBDBM50020109
Substrate/Competitorn/a
Meas. Tech.ChEBML_68382
Ki 10000±n/a nM
Citation Rosowsky, ABader, HKohler, WFreisheim, JHMoran, RG Methotrexate analogues. 34. Replacement of the glutamate moiety in methotrexate and aminopterin by long-chain 2-aminoalkanedioic acids. J Med Chem31:1338-44 (1988) Folylpolyglutamate synthase, mitochondrial
Name:Folylpolyglutamate synthase, mitochondrial
Type:PROTEIN
Mol. Mass.:64621.95
Organism:Homo sapiens (Human)
Description:ChEMBL_68676
Residue:587
BDBM50020109
NameBDBM50020109
Synonyms:2-{4-[(2-Amino-4-oxo-1,4,5,6,7,8-hexahydro-pteridin-6-ylmethyl)-amino]-benzoylamino}-4-carbamoyl-butyric acid | CHEMBL25870
TypeSmall organic molecule
Emp. Form.C19H24N8O5
Mol. Mass.444.4445
SMILESNC(=O)CC[C@H](NC(=O)c1ccc(NCC2CNc3nc(N)[nH]c(=O)c3N2)cc1)C(O)=O