Reaction Details
Target5-hydroxytryptamine receptor 1A
LigandBDBM50020115
Substrate/Competitorn/a
Meas. Tech.ChEBML_1423
Ki 9±n/a nM
Citation Abou-Gharbia, MPatel, URWebb, MBMoyer, JAAndree, THMuth, EA Polycyclic aryl- and heteroarylpiperazinyl imides as 5-HT1A receptor ligands and potential anxiolytic agents: synthesis and structure-activity relationship studies. J Med Chem31:1382-92 (1988) 5-hydroxytryptamine receptor 1A
Name:5-hydroxytryptamine receptor 1A
Type:G Protein-Coupled Receptor (GPCR)
Mol. Mass.:46445.29
Organism:Rattus norvegicus (rat)
Description:Binding assays were performed using rat hippocampal membranes.
Residue:422
BDBM50020115
NameBDBM50020115
Synonyms:4-[4-(4-Pyrimidin-2-yl-piperazin-1-yl)-butyl]-4-aza-tricyclo[5.2.1.0*2,6*]decane-3,5-dione;C4H4O4 | CHEMBL28764
TypeSmall organic molecule
Emp. Form.C21H29N5O2
Mol. Mass.383.4873
SMILESO=C1C2C3CCC(C3)C2C(=O)N1CCCCN1CCN(CC1)c1ncccn1