Reaction Details
Target5-hydroxytryptamine receptor 1A
LigandBDBM50020131
Substrate/Competitorn/a
Meas. Tech.ChEBML_1423
Ki 41±n/a nM
Citation Abou-Gharbia, MPatel, URWebb, MBMoyer, JAAndree, THMuth, EA Polycyclic aryl- and heteroarylpiperazinyl imides as 5-HT1A receptor ligands and potential anxiolytic agents: synthesis and structure-activity relationship studies. J Med Chem31:1382-92 (1988) 5-hydroxytryptamine receptor 1A
Name:5-hydroxytryptamine receptor 1A
Type:G Protein-Coupled Receptor (GPCR)
Mol. Mass.:46445.29
Organism:Rattus norvegicus (rat)
Description:Binding assays were performed using rat hippocampal membranes.
Residue:422
BDBM50020131
NameBDBM50020131
Synonyms:4-{4-[4-(3-chlorophenyl)hexahydro-1-pyrazinyl]butyl}-4-azatetracyclo[5.4.2.02,6.08,11]trideca-9,12-diene-3,5-dione;Hydrochloride | CHEMBL31197
TypeSmall organic molecule
Emp. Form.C26H30ClN3O2
Mol. Mass.451.988
SMILESClc1cccc(c1)N1CCN(CCCCN2C(=O)C3C(C4C=CC3C3C=CC43)C2=O)CC1