Reaction Details
Target5-hydroxytryptamine receptor 1A
LigandBDBM50367734
Substrate/Competitorn/a
Meas. Tech.ChEBML_1423
Ki 17±n/a nM
Citation Abou-Gharbia, MPatel, URWebb, MBMoyer, JAAndree, THMuth, EA Polycyclic aryl- and heteroarylpiperazinyl imides as 5-HT1A receptor ligands and potential anxiolytic agents: synthesis and structure-activity relationship studies. J Med Chem31:1382-92 (1988) 5-hydroxytryptamine receptor 1A
Name:5-hydroxytryptamine receptor 1A
Type:G Protein-Coupled Receptor (GPCR)
Mol. Mass.:46445.29
Organism:Rattus norvegicus (rat)
Description:Binding assays were performed using rat hippocampal membranes.
Residue:422
BDBM50367734
NameBDBM50367734
Synonyms:CHEMBL1202523
TypeSmall organic molecule
Emp. Form.C26H34F3N3O2
Mol. Mass.477.5623
SMILESFC(F)(F)c1cccc(c1)N1CCN(CCCCN2C(=O)C3C(C4CCC3CCC4)C2=O)CC1