Reaction Details
Target5-hydroxytryptamine receptor 1A
LigandBDBM50017433
Substrate/Competitorn/a
Meas. Tech.ChEMBL_1184 (CHEMBL615950)
Ki 53±n/a nM
Citation Abou-Gharbia, MMoyer, JAPatel, UWebb, MSchiehser, GAndree, THaskins, JT Synthesis and structure-activity relationship of substituted tetrahydro- and hexahydro-1,2-benzisothiazol-3-one 1,1-dioxides and thiadiazinones: potential anxiolytic agents. J Med Chem32:1024-33 (1989) 5-hydroxytryptamine receptor 1A
Name:5-hydroxytryptamine receptor 1A
Type:G Protein-Coupled Receptor (GPCR)
Mol. Mass.:46445.29
Organism:Rattus norvegicus (rat)
Description:Binding assays were performed using rat hippocampal membranes.
Residue:422
BDBM50017433
NameBDBM50017433
Synonyms:3,3-Dioxo-4-[4-(4-pyrimidin-2-yl-piperazin-1-yl)-butyl]-3lambda*6*-thia-4-aza-tricyclo[5.2.1.0*2,6*]decan-5-one; dihydrochloride | CHEMBL3216623
TypeSmall organic molecule
Emp. Form.C20H31Cl2N5O3S
Mol. Mass.492.463
SMILESCl.Cl.O=C1C2C3CCC(C3)C2S(=O)(=O)N1CCCCN1CCN(CC1)c1ncccn1