Reaction Details
Target5-hydroxytryptamine receptor 1A
LigandBDBM50005127
Substrate/Competitorn/a
Meas. Tech.ChEMBL_1177 (CHEMBL615943)
Ki 10±n/a nM
Citation Abou-Gharbia, MMoyer, JAPatel, UWebb, MSchiehser, GAndree, THaskins, JT Synthesis and structure-activity relationship of substituted tetrahydro- and hexahydro-1,2-benzisothiazol-3-one 1,1-dioxides and thiadiazinones: potential anxiolytic agents. J Med Chem32:1024-33 (1989) 5-hydroxytryptamine receptor 1A
Name:5-hydroxytryptamine receptor 1A
Type:G Protein-Coupled Receptor (GPCR)
Mol. Mass.:46445.29
Organism:Rattus norvegicus (rat)
Description:Binding assays were performed using rat hippocampal membranes.
Residue:422
BDBM50005127
NameBDBM50005127
Synonyms:1,1-Dioxo-2-[4-(4-pyrimidin-2-yl-piperazin-1-yl)-butyl]-1,2-dihydro-1lambda*6*-benzo[d]isothiazol-3-one 1,1-Dioxo-2-[4-(4-pyrimidin-2-yl-piperazin-1-yl)-butyl]-1,2-dihydro-1lambda*6*-benzo[d]isothiazol-3-one(Ipsapirone) IPSAPIRONE
TypeSmall organic molecule
Emp. Form.C19H23N5O3S
Mol. Mass.401.483
SMILESO=C1N(CCCCN2CCN(CC2)c2ncccn2)S(=O)(=O)c2ccccc12