Reaction Details
TargetD(2) dopamine receptor
LigandBDBM50017443
Substrate/Competitorn/a
Meas. Tech.ChEBML_62579
Ki 85±n/a nM
Citation Abou-Gharbia, MMoyer, JAPatel, UWebb, MSchiehser, GAndree, THaskins, JT Synthesis and structure-activity relationship of substituted tetrahydro- and hexahydro-1,2-benzisothiazol-3-one 1,1-dioxides and thiadiazinones: potential anxiolytic agents. J Med Chem32:1024-33 (1989) D(2) dopamine receptor
Name:D(2) dopamine receptor
Type:G Protein-Coupled Receptor (GPCR)
Mol. Mass.:50931.60
Organism:Rattus norvegicus (rat)
Description:P61169
Residue:444
BDBM50017443
NameBDBM50017443
Synonyms:3,3-Dioxo-4-{4-[4-(3-trifluoromethyl-phenyl)-piperazin-1-yl]-butyl}-3lambda*6*-thia-4-aza-tricyclo[5.2.1.0*2,6*]dec-8-en-5-one; dihydrochloride | CHEMBL3215971
TypeSmall organic molecule
Emp. Form.C23H30Cl2F3N3O3S
Mol. Mass.556.469
SMILESCl.Cl.FC(F)(F)c1cccc(c1)N1CCN(CCCCN2C(=O)C3C4CC(C=C4)C3S2(=O)=O)CC1