Reaction Details
Target5-hydroxytryptamine receptor 1A
LigandBDBM50016966
Substrate/Competitorn/a
Meas. Tech.ChEMBL_819 (CHEMBL615819)
IC50 0.680000±n/a nM
Citation New, JSChristopher, WLYevich, JPButler, RSchlemmer, RFVanderMaelen, CPCipollina, JA The thieno[3,2-c]pyridine and furo[3,2-c]pyridine rings: new pharmacophores with potential antipsychotic activity. J Med Chem32:1147-56 (1989) 5-hydroxytryptamine receptor 1A
Name:5-hydroxytryptamine receptor 1A
Type:G Protein-Coupled Receptor (GPCR)
Mol. Mass.:46445.29
Organism:Rattus norvegicus (rat)
Description:Binding assays were performed using rat hippocampal membranes.
Residue:422
BDBM50016966
NameBDBM50016966
Synonyms:1,1-Dioxo-2-[4-(4-thieno[3,2-c]pyridin-4-yl-piperazin-1-yl)-butyl]-1,2-dihydro-1lambda*6*-benzo[d]isothiazol-3-one; hydrochloride | CHEMBL543967
TypeSmall organic molecule
Emp. Form.C22H24N4O3S2
Mol. Mass.456.581
SMILESO=C1N(CCCCN2CCN(CC2)c2nccc3sccc23)S(=O)(=O)c2ccccc12