Reaction Details
TargetAngiotensin-converting enzyme
LigandBDBM50017125
Substrate/Competitorn/a
Meas. Tech.ChEBML_35985
IC50 0.500000±n/a nM
Citation Smith, EMSwiss, GFNeustadt, BRMcNamara, PGold, EHSybertz, EJBaum, T Angiotensin converting enzyme inhibitors: spirapril and related compounds. J Med Chem32:1600-6 (1989) Angiotensin-converting enzyme
Name:Angiotensin-converting enzyme
Type:Enzyme
Mol. Mass.:149709.01
Organism:Homo sapiens (Human)
Description:n/a
Residue:1306
BDBM50017125
NameBDBM50017125
Synonyms:1-[6-Amino-2-(1-carboxy-3-phenyl-propylamino)-hexanoyl]-pyrrolidine-2-carboxylic acid; hydrate ( Lisinopril) CHEMBL1237 | CHEMBL295690
TypeSmall organic molecule
Emp. Form.C23H33N3O5S2
Mol. Mass.495.655
SMILESNCCCC[C@H](N[C@@H](CCc1ccccc1)C(O)=O)C(=O)N1CC2(C[C@H]1C(O)=O)SCCS2