Reaction Details
TargetSigma non-opioid intracellular receptor 1
LigandBDBM50452655
Substrate/Competitorn/a
Meas. Tech.ChEBML_201290
Ki>6400±n/a nM
Citation Hutchison, AJde Jesus, RWilliams, MSimke, JPNeale, RFJackson, RHAmbrose, FBarbaz, BJSills, MA Benzofuro[2,3-c]pyridin-6-ols: synthesis, affinity for opioid-receptor subtypes, and antinociceptive activity. J Med Chem32:2221-6 (1989) Sigma non-opioid intracellular receptor 1
Name:Sigma non-opioid intracellular receptor 1
Type:Enzyme Catalytic Domain
Mol. Mass.:25246.51
Organism:Mus musculus (Mouse)
Description:O55242
Residue:223
BDBM50452655
NameBDBM50452655
Synonyms:CHEMBL2114080
TypeSmall organic molecule
Emp. Form.C17H25NO2
Mol. Mass.275.3859
SMILES[H][C@]12CN(CCC)CC[C@@]1(CC)c1cc(OC)ccc1O2