Reaction Details
TargetSigma non-opioid intracellular receptor 1
LigandBDBM50017236
Substrate/Competitorn/a
Meas. Tech.ChEBML_201290
Ki 212±n/a nM
Citation Hutchison, AJde Jesus, RWilliams, MSimke, JPNeale, RFJackson, RHAmbrose, FBarbaz, BJSills, MA Benzofuro[2,3-c]pyridin-6-ols: synthesis, affinity for opioid-receptor subtypes, and antinociceptive activity. J Med Chem32:2221-6 (1989) Sigma non-opioid intracellular receptor 1
Name:Sigma non-opioid intracellular receptor 1
Type:Enzyme Catalytic Domain
Mol. Mass.:25246.51
Organism:Mus musculus (Mouse)
Description:O55242
Residue:223
BDBM50017236
NameBDBM50017236
Synonyms:(4aS,9aR)-4a-Ethyl-2-methyl-1,2,3,4,4a,9a-hexahydro-benzo[4,5]furo[2,3-c]pyridin-6-ol CHEMBL430441
TypeSmall organic molecule
Emp. Form.C14H19NO2
Mol. Mass.233.3062
SMILESCC[C@@]12CCN(C)C[C@@H]1Oc1ccc(O)cc21