Reaction Details
TargetKappa-type opioid receptor
LigandBDBM50017234
Substrate/Competitorn/a
Meas. Tech.ChEBML_145372
Ki 270±n/a nM
Citation Hutchison, AJde Jesus, RWilliams, MSimke, JPNeale, RFJackson, RHAmbrose, FBarbaz, BJSills, MA Benzofuro[2,3-c]pyridin-6-ols: synthesis, affinity for opioid-receptor subtypes, and antinociceptive activity. J Med Chem32:2221-6 (1989) Kappa-type opioid receptor
Name:Kappa-type opioid receptor
Type:Enzyme
Mol. Mass.:42656.78
Organism:Mus musculus (Mouse)
Description:P33534
Residue:380
BDBM50017234
NameBDBM50017234
Synonyms:(4aS,9aR)-2-Cyclobutylmethyl-4a-ethyl-1,2,3,4,4a,9a-hexahydro-benzo[4,5]furo[2,3-c]pyridin-6-ol; hydrochloride | CHEMBL542150
TypeSmall organic molecule
Emp. Form.C18H25NO2
Mol. Mass.287.3966
SMILESCC[C@@]12CCN(CC3CCC3)C[C@@H]1Oc1ccc(O)cc21