Reaction Details
TargetKappa-type opioid receptor
LigandBDBM50017231
Substrate/Competitorn/a
Meas. Tech.ChEBML_145372
Ki 2000±n/a nM
Citation Hutchison, AJde Jesus, RWilliams, MSimke, JPNeale, RFJackson, RHAmbrose, FBarbaz, BJSills, MA Benzofuro[2,3-c]pyridin-6-ols: synthesis, affinity for opioid-receptor subtypes, and antinociceptive activity. J Med Chem32:2221-6 (1989) Kappa-type opioid receptor
Name:Kappa-type opioid receptor
Type:Enzyme
Mol. Mass.:42656.78
Organism:Mus musculus (Mouse)
Description:P33534
Residue:380
BDBM50017231
NameBDBM50017231
Synonyms:(4aS,9aR)-4a-Ethyl-2-phenethyl-1,2,3,4,4a,9a-hexahydro-benzo[4,5]furo[2,3-c]pyridin-6-ol CHEMBL72180
TypeSmall organic molecule
Emp. Form.C21H25NO2
Mol. Mass.323.4287
SMILESCC[C@@]12CCN(CCc3ccccc3)C[C@@H]1Oc1ccc(O)cc21