Reaction Details
TargetKappa-type opioid receptor
LigandBDBM50017241
Substrate/Competitorn/a
Meas. Tech.ChEBML_145372
Ki 1500±n/a nM
Citation Hutchison, AJde Jesus, RWilliams, MSimke, JPNeale, RFJackson, RHAmbrose, FBarbaz, BJSills, MA Benzofuro[2,3-c]pyridin-6-ols: synthesis, affinity for opioid-receptor subtypes, and antinociceptive activity. J Med Chem32:2221-6 (1989) Kappa-type opioid receptor
Name:Kappa-type opioid receptor
Type:Enzyme
Mol. Mass.:42656.78
Organism:Mus musculus (Mouse)
Description:P33534
Residue:380
BDBM50017241
NameBDBM50017241
Synonyms:(4aS,9aR)-4a-Ethyl-2-furan-2-ylmethyl-1,2,3,4,4a,9a-hexahydro-benzo[4,5]furo[2,3-c]pyridin-6-ol; hydrochloride | CHEMBL552619
TypeSmall organic molecule
Emp. Form.C18H21NO3
Mol. Mass.299.3642
SMILESCC[C@@]12CCN(Cc3ccco3)C[C@@H]1Oc1ccc(O)cc21