Reaction Details
TargetChymotrypsinogen A
LigandBDBM50014579
Substrate/Competitorn/a
Meas. Tech.ChEBML_216617
Ki 60±n/a nM
Citation Angelastro, MRMehdi, SBurkhart, JPPeet, NPBey, P Alpha-diketone and alpha-keto ester derivatives of N-protected amino acids and peptides as novel inhibitors of cysteine and serine proteinases. J Med Chem33:11-3 (1990) Chymotrypsinogen A
Name:Chymotrypsinogen A
Type:Serine protease
Mol. Mass.:25670.88
Organism:Bos taurus (bovine)
Description:n/a
Residue:245
BDBM50014579
NameBDBM50014579
Synonyms:3-(2-Benzyloxycarbonylamino-3-methyl-butyrylamino)-2-oxo-4-phenyl-butyric acid ethyl ester | CHEMBL25945
TypeSmall organic molecule
Emp. Form.C25H30N2O6
Mol. Mass.454.5155
SMILESCCOC(=O)C(=O)[C@H](Cc1ccccc1)NC(=O)[C@@H](NC(=O)OCc1ccccc1)C(C)C