Reaction Details
TargetD(2) dopamine receptor
LigandBDBM50007423
Substrate/Competitorn/a
Meas. Tech.ChEBML_62705
Ki 0.240000±n/a nM
Citation Gao, YGRam, VJCampbell, AKula, NSBaldessarini, RJNeumeyer, JL Synthesis and structural requirements of N-substituted norapomorphines for affinity and activity at dopamine D-1, D-2, and agonist receptor sites in rat brain. J Med Chem33:39-44 (1990) D(2) dopamine receptor
Name:D(2) dopamine receptor
Type:G Protein-Coupled Receptor (GPCR)
Mol. Mass.:50931.60
Organism:Rattus norvegicus (rat)
Description:P61169
Residue:444
BDBM50007423
NameBDBM50007423
Synonyms:(R)6-Allyl-5,6,6a,7-tetrahydro-4H-dibenzo[de,g]quinoline-10,11-diol CHEMBL318111 cid_11957524
TypeSmall organic molecule
Emp. Form.C19H19NO2
Mol. Mass.293.3597
SMILESOc1ccc2C[C@H]3N(CC=C)CCc4cccc(c34)-c2c1O