Reaction Details
TargetGamma-aminobutyric acid type B receptor subunit 1/2
LigandBDBM24183
Substrate/Competitorn/a
Meas. Tech.ChEMBL_68558 (CHEMBL679645)
pH7.4±n/a
IC50 30±n/a nM
Commentsextracted
Citation Nielsen, LBrehm, LKrogsgaard-Larsen, P GABA agonists and uptake inhibitors. Synthesis, absolute stereochemistry, and enantioselectivity of (R)-(-)- and (S)-(+)-homo-beta-proline. J Med Chem33:71-7 (1990) Gamma-aminobutyric acid type B receptor subunit 1/2
Name:Gamma-aminobutyric acid type B receptor subunit 1/2
Type:n/a
Mol. Mass.:n/a
Description:ASSAY_ID of EBI is 68556
Components:This complex has 2 components.
Component 1
Name:Gamma-aminobutyric acid type B receptor subunit 1
Synonyms:GABA B GABA uptake GABA-B-R1 GABABR1 Gabbr1 | Gb1
Type:Enzyme Catalytic Domain
Mol. Mass.:111548.69
Organism:Rattus norvegicus (Rat)
Description:Q9Z0U4
Residue:991
Component 2
Name:Gamma-aminobutyric acid type B receptor subunit 2
Synonyms:GABA B receptor Gabbr2 | Gpr51
Type:PROTEIN
Mol. Mass.:105775.46
Organism:Rattus norvegicus
Description:O88871
Residue:940
BDBM24183
NameBDBM24183
Synonyms:4-amino-n-[2,3-3H]butyric acid Aminalon GABA [3H]GABA | cid_119
TypeRadiolabeled ligand
Emp. Form.C4H9NO2
Mol. Mass.103.1198
SMILESNCCCC(O)=O