Reaction Details
TargetAromatase
LigandBDBM50014310
Substrate/Competitorn/a
Meas. Tech.ChEBML_50885
Ki 3±n/a nM
Citation Cole, PARobinson, CH Mechanism and inhibition of cytochrome P-450 aromatase. J Med Chem33:2933-42 (1990) Aromatase
Name:Aromatase
Type:Enzyme
Mol. Mass.:57888.92
Organism:Homo sapiens (Human)
Description:P11511
Residue:503
BDBM50014310
NameBDBM50014310
Synonyms:13-Methyl-10-vinyl-1,6,7,8,9,10,11,12,13,14,15,16-dodecahydro-2H-cyclopenta[a]phenanthrene-3,17-dione | CHEMBL98685
TypeSmall organic molecule
Emp. Form.C20H26O2
Mol. Mass.298.4192
SMILESC[C@]12CCC3C(CCC4=CC(=O)CC[C@]34C=C)C1CCC2=O