Reaction Details
TargetUrokinase-type plasminogen activator
LigandBDBM50014332
Substrate/Competitorn/a
Meas. Tech.ChEMBL_213160 (CHEMBL816645)
Ki 259000±n/a nM
Citation Yang, HHenkin, JKim, KHGreer, J Selective inhibition of urokinase by substituted phenylguanidines: quantitative structure-activity relationship analyses. J Med Chem33:2956-61 (1990) Urokinase-type plasminogen activator
Name:Urokinase-type plasminogen activator
Type:Enzyme
Mol. Mass.:48528.62
Organism:Homo sapiens (Human)
Description:P00749
Residue:431
BDBM50014332
NameBDBM50014332
Synonyms:1N-amino(immino)methyl-2-methylaniline
TypeSmall organic molecule
Emp. Form.C8H12N3
Mol. Mass.150.2004
SMILESCc1ccccc1NC(N)=[NH2+]